Target
D(1B) dopamine receptor
Ligand
BDBM81871
Substrate
Ki
909±n/a nM
Comments
PDSP_245
Citation
 Sunahara, RKGuan, HCO'Dowd, BFSeeman, PLaurier, LGNg, GGeorge, SRTorchia, JVan Tol, HHNiznik, HB Cloning of the gene for a human dopamine D5 receptor with higher affinity for dopamine than D1. Nature 350:614-9 (1991)  
Target
Name:
D(1B) dopamine receptor
Synonyms:
D(5) dopamine receptor DOPAMINE D5 DRD1L2 DRD5_HUMAN | dopamine receptor D5
Type:
Protein
Mol. Mass.:
52943.41
Organism:
Homo sapiens (Human)
Description:
P21918
Residue:
477
  
Inhibitor
Name:
BDBM81871
Synonyms:
ADTN, (+) NSC_16
Type:
Small organic molecule
Emp. Form.:
C12H22N2O2
Mol. Mass.:
226.3153
SMILES:
O=C1CCCCCNC(=O)CCCCCN1
: