Target
Dopamine receptor D4
Ligand
BDBM50007567
Substrate
Ki
13.5±n/a nM
Comments
PDSP_3957
Citation
 Van Tol, HHBunzow, JRGuan, HCSunahara, RKSeeman, PNiznik, HBCivelli, O Cloning of the gene for a human dopamine D4 receptor with high affinity for the antipsychotic clozapine. Nature 350:610-4 (1991)  
Target
Name:
Dopamine receptor D4
Synonyms:
DOPAMINE D2 Long DRD2 | Dopamine receptor D4
Type:
Enzyme Catalytic Domain
Mol. Mass.:
43731.97
Organism:
CANINE
Description:
Q589Y6
Residue:
421
  
Inhibitor
Name:
BDBM50007567
Synonyms:
1-(8-Chloro-10,11-dihydro-dibenzo[b,f]thiepin-10-yl)-4-methyl-piperazine OCTOCLOTHEPIN-R
Type:
Small organic molecule
Emp. Form.:
C19H21ClN2S
Mol. Mass.:
344.901
SMILES:
CN1CCN(CC1)[C@@H]1Cc2ccccc2Sc2ccc(Cl)cc12
: