Target
Dopamine receptor D4
Ligand
BDBM22869
Substrate
Ki
9±n/a nM
Comments
PDSP_552
Citation
 Van Tol, HHBunzow, JRGuan, HCSunahara, RKSeeman, PNiznik, HBCivelli, O Cloning of the gene for a human dopamine D4 receptor with high affinity for the antipsychotic clozapine. Nature 350:610-4 (1991)  
Target
Name:
Dopamine receptor D4
Synonyms:
DOPAMINE D2 Long DRD2 | Dopamine receptor D4
Type:
Enzyme Catalytic Domain
Mol. Mass.:
43731.97
Organism:
CANINE
Description:
Q589Y6
Residue:
421
  
Inhibitor
Name:
BDBM22869
Synonyms:
6-chloro-10-(4-methylpiperazin-1-yl)-2,9-diazatricyclo[9.4.0.0^{3,8}]pentadeca-1,3(8),4,6,10,12,14-heptaene Clozapine US10259786, Clozapine
Type:
Small organic molecule
Emp. Form.:
C18H19ClN4
Mol. Mass.:
326.823
SMILES:
CN1CCN(CC1)C1=c2ccccc2=Nc2ccc(Cl)cc2N1
: