Target
Gamma-aminobutyric acid type B receptor subunit 1
Ligand
BDBM50026756
Substrate
Ki
12±n/a nM
Comments
PDSP_534
Citation
 Massotti, MSchlichting, JLAntonacci, MDGiusti, PMemo, MCosta, EGuidotti, A gamma-Aminobutyric acidA receptor heterogeneity in rat central nervous system: studies with clonazepam and other benzodiazepine ligands. J Pharmacol Exp Ther 256:1154-60 (1991) Target
Name:
Gamma-aminobutyric acid type B receptor subunit 1
Synonyms:
GABA B GABA uptake GABA-B-R1 GABABR1 Gabbr1 | Gb1
Type:
Enzyme Catalytic Domain
Mol. Mass.:
111548.69
Organism:
Rattus norvegicus (Rat)
Description:
Q9Z0U4
Residue:
991
  
Inhibitor
Name:
BDBM50026756
Synonyms:
3-Methyl-6-(3-trifluoromethyl-phenyl)-[1,2,4]triazolo[4,3-b]pyridazine CI-218872 CL218,872 | v3-Methyl-6-(3-trifluoromethyl-phenyl)-[1,2,4]triazolo[4,3-b]pyridazine
Type:
Small organic molecule
Emp. Form.:
C13H9F3N4
Mol. Mass.:
278.2326
SMILES:
Cc1nnc2ccc(nn12)-c1cccc(c1)C(F)(F)F
: