Target
Gamma-aminobutyric acid type B receptor subunit 1
Ligand
BDBM50000766
Substrate
Ki
18±n/a nM
Comments
PDSP_656
Citation
 Massotti, MSchlichting, JLAntonacci, MDGiusti, PMemo, MCosta, EGuidotti, A gamma-Aminobutyric acidA receptor heterogeneity in rat central nervous system: studies with clonazepam and other benzodiazepine ligands. J Pharmacol Exp Ther 256:1154-60 (1991) Target
Name:
Gamma-aminobutyric acid type B receptor subunit 1
Synonyms:
GABA B GABA uptake GABA-B-R1 GABABR1 Gabbr1 | Gb1
Type:
Enzyme Catalytic Domain
Mol. Mass.:
111548.69
Organism:
Rattus norvegicus (Rat)
Description:
Q9Z0U4
Residue:
991
  
Inhibitor
Name:
BDBM50000766
Synonyms:
CHEMBL12 US9271961, Diazepam
Type:
Small organic molecule
Emp. Form.:
C16H13ClN2O
Mol. Mass.:
284.74
SMILES:
CN1c2ccc(Cl)cc2C(=NCC1=O)c1ccccc1
: