Target
Muscarinic acetylcholine receptor M2
Ligand
BDBM81897
Substrate
Ki
131.83±n/a nM
Comments
PDSP_2385
Citation
 Dörje, FWess, JLambrecht, GTacke, RMutschler, EBrann, MR Antagonist binding profiles of five cloned human muscarinic receptor subtypes. J Pharmacol Exp Ther 256:727-33 (1991) Target
Name:
Muscarinic acetylcholine receptor M2
Synonyms:
ACM2_HUMAN Cholinergic, muscarinic M2 Muscarinic acetylcholine receptor M2 and M5 | RecName: Full=Muscarinic acetylcholine receptor M2
Type:
GPCR
Mol. Mass.:
51730.61
Organism:
Homo sapiens (Human)
Description:
P08172
Residue:
466
  
Inhibitor
Name:
BDBM81897
Synonyms:
CAS_5311091 p-F-HHSiD
Type:
Small organic molecule
Emp. Form.:
C39H53N11O11
Mol. Mass.:
851.9052
SMILES:
CCC(C)C(NC(=O)C(CO)NC(=O)C(Cc1cnc[nH]1)NC(=O)C(Cc1cnc[nH]1)NC(=O)C(Cc1ccccc1)NC(=O)C1CCCN1)C(=O)NC(CC(O)=O)C(O)=O
: