Target
Carboxypeptidase B2
Ligand
BDBM81911
Substrate
Meas. Tech.
Inhibition Assay
Ki
1.33e+4±n/a nM
Citation
 Fernández, DAvilés, FXVendrell, J Aromatic organic compounds as scaffolds for metallocarboxypeptidase inhibitor design. Chem Biol Drug Des 73:75-82 (2009)  
Target
Name:
Carboxypeptidase B2
Synonyms:
CBPB2_HUMAN CPU Carboxypeptidase B2 isoform A Plasma carboxypeptidase B Thrombin-activable fibrinolysis inhibitor | pCPB
Type:
Enzyme
Mol. Mass.:
48432.74
Organism:
Homo sapiens (Human)
Description:
Q96IY4
Residue:
423
  
Inhibitor
Name:
BDBM81911
Synonyms:
methyl 2-(3-furan-2-ylmethyl)-3-((8-methyl-2-oxo-1,2,-dihydroquinolin-3-yl)methyl)thioureido)benzoate, 11
Type:
Small organic molecule
Emp. Form.:
C25H23N3O4S
Mol. Mass.:
461.533
SMILES:
COC(=O)c1ccccc1NC(=S)N(Cc1ccco1)Cc1cc2cccc(C)c2[nH]c1=O
: