Target
D(2) dopamine receptor
Ligand
BDBM50008782
Substrate
Ki
0.05±n/a nM
Comments
PDSP_789
Citation
 Neve, KA Regulation of dopamine D2 receptors by sodium and pH. Mol Pharmacol 39:570-8 (1991) Target
Name:
D(2) dopamine receptor
Synonyms:
DOPAMINE D2 Dopamine D2 receptor Drd2
Type:
Enzyme
Mol. Mass.:
50957.64
Organism:
Mus musculus (Mouse)
Description:
P61168
Residue:
444
  
Inhibitor
Name:
BDBM50008782
Synonyms:
CHEMBL44237 Epidepride;N-(1-Ethyl-pyrrolidin-2-ylmethyl)-5-iodo-2,3-dimethoxy-benzamide | N-(1-Ethyl-pyrrolidin-2-ylmethyl)-5-iodo-2,3-dimethoxy-benzamide (epidepride)
Type:
Small organic molecule
Emp. Form.:
C16H23IN2O3
Mol. Mass.:
418.2699
SMILES:
CCN1CCC[C@H]1CNC(=O)c1cc(I)cc(OC)c1OC
: