Target
D(1A) dopamine receptor
Ligand
BDBM81195
Substrate
Ki
>10000±n/a nM
Comments
PDSP_239
Citation
 Simonneaux, VMurrin, LCEbadi, M Characterization of D1 dopamine receptors in the bovine pineal gland with [3H]SCH 23390. J Pharmacol Exp Ther 253:214-20 (1990) Target
Name:
D(1A) dopamine receptor
Synonyms:
D(1A) dopamine receptor DOPAMINE D1 DRD1_BOVIN | Dopamine receptor
Type:
Enzyme Catalytic Domain
Mol. Mass.:
49330.65
Organism:
BOVINE
Description:
DOPAMINE D1 DRD1 BOVINE::Q95136
Residue:
446
  
Inhibitor
Name:
BDBM81195
Synonyms:
(+/-)-2-Amino-6,7-dihydroxy-1,2,3,4-tetrahydronaphthalene hydrobromide 6-Amino-5,6,7,8-tetrahydro-naphthalene-2,3-diol 6-azanyl-5,6,7,8-tetrahydronaphthalene-2,3-diol;hydrobromide ADTN, (+) CHEMBL26736 SMR001254097 cid_3153
Type:
Small organic molecule
Emp. Form.:
C10H13NO2
Mol. Mass.:
179.2157
SMILES:
NC1CCc2cc(O)c(O)cc2C1
: