Target
Muscarinic acetylcholine receptor M1
Ligand
BDBM86231
Substrate
Ki
0.32±n/a nM
Comments
PDSP_2312
Citation
 Hulme, ECBirdsall, NJBuckley, NJ Muscarinic receptor subtypes. Annu Rev Pharmacol Toxicol 30:633-73 (1990)  
Target
Name:
Muscarinic acetylcholine receptor M1
Synonyms:
ACM1_RAT Chrm-1 cholinergic receptor, muscarinic 1
Type:
Enzyme Catalytic Domain
Mol. Mass.:
51390.46
Organism:
RAT
Description:
P08482
Residue:
460
  
Inhibitor
Name:
BDBM86231
Synonyms:
ATR Atropine,(-) CHEMBL195 US9333195, ATROPINE
Type:
Small organic molecule
Emp. Form.:
C17H23NO3
Mol. Mass.:
289.3694
SMILES:
CN1C2CCC1CC(C2)OC(=O)C(CO)c1ccccc1
: