Target
Substance-K receptor
Ligand
BDBM81943
Substrate
Ki
11±n/a nM
Comments
PDSP_1012
Citation
 Burcher, EBuck, SHLovenberg, WO'Donohue, TL Characterization and autoradiographic localization of multiple tachykinin binding sites in gastrointestinal tract and bladder. J Pharmacol Exp Ther 236:819-31 (1986) Target
Name:
Substance-K receptor
Synonyms:
NK2R_CAVPO Neurokinin NK2 TACR2
Type:
Enzyme Catalytic Domain
Mol. Mass.:
45106.00
Organism:
GUINEA PIG
Description:
Neurokinin NK2 TACR2 GUINEA PIG::Q64077
Residue:
402
  
Inhibitor
Name:
BDBM81943
Synonyms:
CAS_45749 kassinin
Type:
Small organic molecule
Emp. Form.:
C59H95N15O18S
Mol. Mass.:
1334.54
SMILES:
CSCCC(NC(=O)C(CC(C)C)NC(=O)CNC(=O)C(NC(=O)C(Cc1ccccc1)NC(=O)C(CCC(N)=O)NC(=O)C(CC(O)=O)NC(=O)C(CO)NC(=O)C(CCCCN)NC(=O)C1CCCN1C(=O)C(NC(=O)C(N)CC(O)=O)C(C)C)C(C)C)C(N)=O
: