Target
Protachykinin-1
Ligand
BDBM81944
Substrate
Ki
50±n/a nM
Comments
PDSP_1306
Citation
 Burcher, EBuck, SHLovenberg, WO'Donohue, TL Characterization and autoradiographic localization of multiple tachykinin binding sites in gastrointestinal tract and bladder. J Pharmacol Exp Ther 236:819-31 (1986) Target
Name:
Protachykinin-1
Synonyms:
Nka Protachykinin-1 Substance P Tac1 | Tac2
Type:
Enzyme Catalytic Domain
Mol. Mass.:
15007.06
Organism:
RAT
Description:
Substance K 0 RAT::P06767
Residue:
130
  
Inhibitor
Name:
BDBM81944
Synonyms:
CAS_86933-75-7 NSC_5311312 | neuromedin K
Type:
Small organic molecule
Emp. Form.:
C55H79N13O14S2
Mol. Mass.:
1210.424
SMILES:
CSCCC(NC(=O)C(CC(C)C)NC(=O)CNC(=O)C(NC(=O)C(Cc1ccccc1)NC(=O)C(Cc1ccccc1)NC(=O)C(CC(O)=O)NC(=O)C(Cc1cnc[nH]1)NC(=O)C(CCSC)NC(=O)C(N)CC(O)=O)C(C)C)C(N)=O
: