Target
D(2) dopamine receptor
Ligand
BDBM81950
Substrate
Ki
0.13±n/a nM
Comments
PDSP_3871
Citation
 Sánchez-Roa, PMGrigoriadis, DEWilson, AASharkey, JDannals, RFVillemagne, VLWong, DFWagner, HNKuhar, MJ [125]I-spectramide: a novel benzamide displaying potent and selective effects at the D2 dopamine receptor. Life Sci 45:1821-9 (1989)  
Target
Name:
D(2) dopamine receptor
Synonyms:
DOPAMINE D2 DOPAMINE D2 Short Dopamine D2 receptor Drd2
Type:
G Protein-Coupled Receptor (GPCR)
Mol. Mass.:
50931.60
Organism:
Rattus norvegicus (rat)
Description:
P61169
Residue:
444
  
Inhibitor
Name:
BDBM81950
Synonyms:
CAS_130377 Spectramide
Type:
Small organic molecule
Emp. Form.:
C19H23ClIN3O2
Mol. Mass.:
487.762
SMILES:
CNc1cc(OC)c(cc1Cl)C(=O)NCCN(C)Cc1ccc(I)cc1
: