Target
Muscarinic acetylcholine receptor M1
Ligand
BDBM81799
Substrate
Ki
44±n/a nM
Comments
PDSP_931
Citation
 Buckley, NJBonner, TIBuckley, CMBrann, MR Antagonist binding properties of five cloned muscarinic receptors expressed in CHO-K1 cells. Mol Pharmacol 35:469-76 (1989) Target
Name:
Muscarinic acetylcholine receptor M1
Synonyms:
ACM1_RAT Chrm-1 cholinergic receptor, muscarinic 1
Type:
Enzyme Catalytic Domain
Mol. Mass.:
51390.46
Organism:
RAT
Description:
P08482
Residue:
460
  
Inhibitor
Name:
BDBM81799
Synonyms:
CAS_98299-40-2 NSC_3602 | hexahydrosiladifenidol
Type:
Small organic molecule
Emp. Form.:
C20H33NOSi
Mol. Mass.:
331.5676
SMILES:
O[Si](CCCN1CCCCC1)(C1CCCCC1)c1ccccc1
: