Target
Muscarinic acetylcholine receptor M2
Ligand
BDBM86231
Substrate
Ki
0.39±n/a nM
Comments
PDSP_334
Citation
 Gies, JPBertrand, CVanderheyden, PWaeldele, FDumont, PPauli, GLandry, Y Characterization of muscarinic receptors in human, guinea pig and rat lung. J Pharmacol Exp Ther 250:309-15 (1989) Target
Name:
Muscarinic acetylcholine receptor M2
Synonyms:
ACM2_PIG Cholinergic, muscarinic LOC100715343 Muscarinic receptor 2
Type:
Enzyme Catalytic Domain
Mol. Mass.:
51688.65
Organism:
GUINEA PIG
Description:
Cholinergic, muscarinic 0 GUINEA PIG::P06199
Residue:
466
  
Inhibitor
Name:
BDBM86231
Synonyms:
ATR Atropine,(-) CHEMBL195 US9333195, ATROPINE
Type:
Small organic molecule
Emp. Form.:
C17H23NO3
Mol. Mass.:
289.3694
SMILES:
CN1C2CCC1CC(C2)OC(=O)C(CO)c1ccccc1
: