Target
Histamine H1 receptor
Ligand
BDBM50007534
Substrate
Ki
>10000±n/a nM
Comments
PDSP_2278
Citation
 Hall, HSällemark, MJerning, E Effects of remoxipride and some related new substituted salicylamides on rat brain receptors. Acta Pharmacol Toxicol (Copenh) 58:61-70 (1986)  
Target
Name:
Histamine H1 receptor
Synonyms:
HISTAMINE H1 Hrh1
Type:
Enzyme Catalytic Domain
Mol. Mass.:
55716.35
Organism:
RAT
Description:
HISTAMINE H1 HRH1 RAT::P31390
Residue:
486
  
Inhibitor
Name:
BDBM50007534
Synonyms:
3-Bromo-N-((S)-1-ethyl-pyrrolidin-2-ylmethyl)-2-hydroxy-6-methoxy-benzamide A 35043 | CHEMBL283099
Type:
Small organic molecule
Emp. Form.:
C15H21BrN2O3
Mol. Mass.:
357.243
SMILES:
CCN1CCC[C@H]1CNC(=O)c1c(O)c(Br)ccc1OC
: