Target
Histamine H1 receptor
Ligand
BDBM50007518
Substrate
Ki
>10000±n/a nM
Comments
PDSP_802
Citation
 Hall, HSällemark, MJerning, E Effects of remoxipride and some related new substituted salicylamides on rat brain receptors. Acta Pharmacol Toxicol (Copenh) 58:61-70 (1986)  
Target
Name:
Histamine H1 receptor
Synonyms:
HISTAMINE H1 Hrh1
Type:
Enzyme Catalytic Domain
Mol. Mass.:
55716.35
Organism:
RAT
Description:
HISTAMINE H1 HRH1 RAT::P31390
Residue:
486
  
Inhibitor
Name:
BDBM50007518
Synonyms:
(S)-3-chloro-5-ethyl-N-((1-ethylpyrrolidin-2-yl)methyl)-6-hydroxy-2-methoxybenzamide 3-Chloro-5-ethyl-N-((S)-1-ethyl-pyrrolidin-2-ylmethyl)-6-hydroxy-2-methoxy-benzamide 3-Chloro-5-ethyl-N-(1-ethyl-pyrrolidin-2-ylmethyl)-6-hydroxy-2-methoxy-benzamide (etichlopride) 3-chloro-5-ethyl-N-{[(2S)-1-ethylpyrrolidin-2-yl]methyl}-6-hydroxy-2-methoxybenzamide ETICLOPRIDE Eticlopride;3-Chloro-5-ethyl-N-(1-ethyl-pyrrolidin-2-ylmethyl)-6-hydroxy-2-methoxy-benzamide
Type:
Small organic molecule
Emp. Form.:
C17H25ClN2O3
Mol. Mass.:
340.845
SMILES:
CCN1CCC[C@H]1CNC(=O)c1c(O)c(CC)cc(Cl)c1OC
: