Target
Alpha-1A adrenergic receptor
Ligand
BDBM29568
Substrate
Ki
0.02±n/a nM
Comments
PDSP_1528
Citation
 Jones, SBSmith, JMJones, AWBylund, DB Alpha-1 adrenergic receptor binding in aortas from rat and dog: comparison of [3H]prazosin and beta-iodo-[125I]-4-hydroxyphenyl-ethyl-aminomethyl-tetralone. J Pharmacol Exp Ther 241:875-81 (1987) Target
Name:
Alpha-1A adrenergic receptor
Synonyms:
ADA1A_CANLF ADRA1C | adrenergic Alpha1
Type:
Enzyme Catalytic Domain
Mol. Mass.:
32268.65
Organism:
Dog
Description:
adrenergic Alpha1 0 Dog::O77621
Residue:
295
  
Inhibitor
Name:
BDBM29568
Synonyms:
CHEMBL2 PRAZOSIN HYDROCHLORIDE [3H]-Minipress [3H]-Prazosin
Type:
radiolabeled ligand
Emp. Form.:
C19H21N5O4
Mol. Mass.:
383.4011
SMILES:
COc1cc2nc(nc(N)c2cc1OC)N1CCN(CC1)C(=O)c1ccco1
: