Target
Interleukin-1 receptor-associated kinase 1
Ligand
BDBM271361
Substrate
Meas. Tech.
IRAK1 Enzymatic Assay
pH
7±n/a
IC50
<100±n/a nM
Comments
extracted
Citation
 Jorand-Lebrun, CKulkarni, SChristmann-Franck, S Macrocyclic pyridazinone derivatives US Patent  US10064861 Publication Date 9/4/2018 
Target
Name:
Interleukin-1 receptor-associated kinase 1
Synonyms:
IRAK IRAK1 Interleukin-1 receptor-associated kinase 1 (IRAK-1)
Type:
Enzyme
Mol. Mass.:
76536.81
Organism:
Homo sapiens (Human)
Description:
P51617
Residue:
712
  
Inhibitor
Name:
BDBM271361
Synonyms:
US10064861, Compound 16
Type:
Small organic molecule
Emp. Form.:
C25H18N6O2
Mol. Mass.:
434.4494
SMILES:
O=C1Nc2nc3ccccc3n2Cc2cc(ccn2)-c2ccc(=O)n(Cc3cccc1c3)n2
: