Target
D(1A) dopamine receptor
Ligand
BDBM50130290
Substrate
Ki
>10000±n/a nM
Comments
PDSP_1247
Citation
 Andersen, PH Comparison of the pharmacological characteristics of [3H]raclopride and [3H]SCH 23390 binding to dopamine receptors in vivo in mouse brain. Eur J Pharmacol 146:113-20 (1988)  
Target
Name:
D(1A) dopamine receptor
Synonyms:
D(1A) dopamine receptor DRD1_MOUSE Dopamine receptor Drd1a | Gpcr15
Type:
Enzyme
Mol. Mass.:
49613.93
Organism:
Mus musculus (Mouse)
Description:
Q61616
Residue:
446
  
Inhibitor
Name:
BDBM50130290
Synonyms:
3-Ethyl-2-methyl-5-morpholin-4-ylmethyl-1,5,6,7-tetrahydro-indol-4-one CHEMBL460 Moban
Type:
Small organic molecule
Emp. Form.:
C16H24N2O2
Mol. Mass.:
276.374
SMILES:
CCc1c(C)[nH]c2CCC(CN3CCOCC3)C(=O)c12
: