Target
Alpha-1A adrenergic receptor
Ligand
BDBM31046
Substrate
Ki
14.92±n/a nM
Comments
PDSP_1479
Citation
 Richelson, E Neuroleptic binding to human brain receptors: relation to clinical effects. Ann N Y Acad Sci 537:435-42 (1988)  
Target
Name:
Alpha-1A adrenergic receptor
Synonyms:
ADA1A_HUMAN ADRA1C Alpha 1A-adrenoceptor Alpha adrenergic receptor 1a Alpha-adrenergic receptor 1c adrenergic Alpha1 | adrenergic Alpha1C
Type:
Cell-surface receptors
Mol. Mass.:
51511.67
Organism:
Homo sapiens (Human)
Description:
P35348
Residue:
466
  
Inhibitor
Name:
BDBM31046
Synonyms:
3-[4,5-dihydro-1H-imidazol-2-ylmethyl-(4-methylphenyl)amino]phenol;methanesulfonic acid 3-[N-(2-imidazolin-2-ylmethyl)-4-methyl-anilino]phenol;mesylic acid MLS000069487 PHENTOLAMINE MESYLATE cid_5775 | cid_91430
Type:
Small organic molecule
Emp. Form.:
C17H19N3O
Mol. Mass.:
281.3523
SMILES:
Cc1ccc(cc1)N(CC1=NCCN1)c1cccc(O)c1
: