Target
Muscarinic acetylcholine receptor M2
Ligand
BDBM21397
Substrate
Ki
2702.7±n/a nM
Comments
PDSP_1739
Citation
 Richelson, E Neuroleptic binding to human brain receptors: relation to clinical effects. Ann N Y Acad Sci 537:435-42 (1988)  
Target
Name:
Muscarinic acetylcholine receptor M2
Synonyms:
ACM2_HUMAN Cholinergic, muscarinic M2 Muscarinic acetylcholine receptor M2 and M5 | RecName: Full=Muscarinic acetylcholine receptor M2
Type:
GPCR
Mol. Mass.:
51730.61
Organism:
Homo sapiens (Human)
Description:
P08172
Residue:
466
  
Inhibitor
Name:
BDBM21397
Synonyms:
8-[4-(4-fluorophenyl)-4-keto-butyl]-1-phenyl-1,3,8-triazaspiro[4.5]decan-4-one 8-[4-(4-fluorophenyl)-4-oxobutyl]-1-phenyl-1,3,8-triazaspiro[4.5]decan-4-one MLS000028615 SPIPERONE US9359372, Spiperone cid_5265
Type:
radiolabeled ligand
Emp. Form.:
C23H26FN3O2
Mol. Mass.:
395.4698
SMILES:
Fc1ccc(cc1)C(=O)CCCN1CCC2(CC1)N(CNC2=O)c1ccccc1
: