Target
Norepinephrine transporter
Ligand
BDBM25870
Substrate
Ki
2750±n/a nM
Comments
PDSP_532
Citation
 Shank, RPVaught, JLPelley, KASetler, PEMcComsey, DFMaryanoff, BE McN-5652: a highly potent inhibitor of serotonin uptake. J Pharmacol Exp Ther 247:1032-8 (1988) Target
Name:
Norepinephrine transporter
Synonyms:
Type:
Enzyme Catalytic Domain
Mol. Mass.:
2082.45
Organism:
RAT
Description:
Norepinephrine transporter 0 RAT::Q9JIA2
Residue:
19
MLLARMKPQVQPELGGADQ
  
Inhibitor
Name:
BDBM25870
Synonyms:
1-[3-(dimethylamino)propyl]-1-(4-fluorophenyl)-1,3-dihydro-2-benzofuran-5-carbonitrile CITALOPRAM Escitalopram [3H]Cytalopram [3H]Lexapro
Type:
radiolabeled ligand
Emp. Form.:
C20H21FN2O
Mol. Mass.:
324.3919
SMILES:
CN(C)CCCC1(OCc2cc(ccc12)C#N)c1ccc(F)cc1
: