Target
Norepinephrine transporter
Ligand
BDBM81988
Substrate
Ki
3.04±n/a nM
Comments
PDSP_3139
Citation
 Shank, RPVaught, JLPelley, KASetler, PEMcComsey, DFMaryanoff, BE McN-5652: a highly potent inhibitor of serotonin uptake. J Pharmacol Exp Ther 247:1032-8 (1988) Target
Name:
Norepinephrine transporter
Synonyms:
Type:
Enzyme Catalytic Domain
Mol. Mass.:
2082.45
Organism:
RAT
Description:
Norepinephrine transporter 0 RAT::Q9JIA2
Residue:
19
MLLARMKPQVQPELGGADQ
  
Inhibitor
Name:
BDBM81988
Synonyms:
McN-5652-W-68 | McN-5652-Z-68
Type:
Emp. Form.:
C19H21NS
Mol. Mass.:
295.442
SMILES:
CSc1ccc(cc1)[C@@H]1CN2CCC[C@@H]2c2ccccc12
: