Target
Sodium-dependent serotonin transporter
Ligand
BDBM30130
Substrate
Ki
1±n/a nM
Comments
PDSP_830
Citation
 Kovachich, GBAronson, CEBrunswick, DJFrazer, A Quantitative autoradiography of serotonin uptake sites in rat brain using [3H]cyanoimipramine. Brain Res 454:78-88 (1988)  
Target
Name:
Sodium-dependent serotonin transporter
Synonyms:
5-HT Transporter 5HT transporter Anandamid membrane transporter, AMT Monoamine transporters; Norepinephrine & serotonin Slc6a4 Sodium-dependent serotonin transporter (SERT) | imipramine receptor
Type:
Multi-pass membrane protein
Mol. Mass.:
70168.43
Organism:
Rattus norvegicus (rat)
Description:
P31652
Residue:
630
  
Inhibitor
Name:
BDBM30130
Synonyms:
CHEMBL1201082 Fluoxetin Prozac cid_62857
Type:
Small organic molecule
Emp. Form.:
C17H18F3NO
Mol. Mass.:
309.3261
SMILES:
CNCCC(Oc1ccc(cc1)C(F)(F)F)c1ccccc1
: