Target
Sigma non-opioid intracellular receptor 1
Ligand
BDBM83449
Substrate
Ki
956±n/a nM
Comments
PDSP_1474
Citation
 Largent, BLGundlach, ALSnyder, SH Psychotomimetic opiate receptors labeled and visualized with (+)-[3H]3-(3-hydroxyphenyl)-N-(1-propyl)piperidine. Proc Natl Acad Sci U S A 81:4983-7 (1984)  
Target
Name:
Sigma non-opioid intracellular receptor 1
Synonyms:
Opioid receptor SGMR1_RAT Sigma non-opioid intracellular receptor 1 Sigma-1 | Sigmar1
Type:
Enzyme Catalytic Domain
Mol. Mass.:
25266.54
Organism:
RAT
Description:
Q9R0C9
Residue:
223
  
Inhibitor
Name:
BDBM83449
Synonyms:
1-(1-phenylcyclohexyl)piperidine;hydrochloride PCP PHENCYCLIDINE SMR001338811 | cid_9795678
Type:
Small organic molecule
Emp. Form.:
C17H25N
Mol. Mass.:
243.3871
SMILES:
C1CCN(CC1)C1(CCCCC1)c1ccccc1
: