Target
cAMP-dependent protein kinase catalytic subunit alpha
Ligand
BDBM3049
Substrate
Histone VII-S
Meas. Tech.
PKA assay
IC50
510±n/a nM
Citation
 Kleinschroth, JHartenstein, JRudolph, CSchachtele, C Novel Indolocarbazole protein kinase C inhibitors with improved biochemical and physicochemical properties. Bioorg Med Chem Lett 5:55-60 (1995)    Article 
Target
Name:
cAMP-dependent protein kinase catalytic subunit alpha
Synonyms:
KAPCA_BOVIN PKC Protein Kinase C cAMP-Dependent Protein Kinase (PKA) cAMP-dependent protein kinase A cAMP-dependent protein kinase, alpha-catalytic subunit
Type:
Enzyme Complex
Mol. Mass.:
40627.77
Organism:
Bos taurus (bovine)
Description:
The PKA holoenzyme purified from bovine heart, exists as an inactive tetrameric complex, which consists of a regulatory dimer associated with two catalytic subunits. It requires cAMP to activate the enzymatic reaction.
Residue:
351
  
Inhibitor
Name:
BDBM3049
Synonyms:
23-[3-(dimethylamino)-2-hydroxypropyl]-7-methoxy-3-methyl-3,13,23-triazahexacyclo[14.7.0.0^{2,10}.0^{4,9}.0^{11,15}.0^{17,22}]tricosa-1(16),2(10),4,6,8,11(15),17(22),18,20-nonaene-12,14-dione Indolocarbazole deriv.
Type:
Small organic molecule
Emp. Form.:
C27H26N4O4
Mol. Mass.:
470.5197
SMILES:
COc1ccc2n(C)c3c(c4C(=O)NC(=O)c4c4c5ccccc5n(CC(O)CN(C)C)c34)c2c1
:
Substrate
Name:
Histone VII-S
Synonyms:
Type:
Other Protein Type
Mol. Mass.:
358.43
Organism:
Description:
40 uM ATP (0.3 uCi [gamma-32P]ATP) as co-substrate.
Residue:
3
NA