Target
D(2) dopamine receptor
Ligand
BDBM50026957
Substrate
Ki
470±n/a nM
Comments
PDSP_358
Citation
 Zahniser, NRDubocovich, ML Comparison of dopamine receptor sites labeled by [3H]-S-sulpiride and [3H]-spiperone in striatum. J Pharmacol Exp Ther 227:592-9 (1983) Target
Name:
D(2) dopamine receptor
Synonyms:
DOPAMINE D2 | DRD2
Type:
Enzyme Catalytic Domain
Mol. Mass.:
50660.69
Organism:
RABBIT
Description:
DOPAMINE D2 DRD2 RABBIT::G1T1Q0
Residue:
443
  
Inhibitor
Name:
BDBM50026957
Synonyms:
(cis) 2-{4-[3-(2-Trifluoromethyl-thioxanthen-9-ylidene)-propyl]-piperazin-1-yl}-ethanol(Flupentixol) 2-(4-{3-[2-Trifluoromethyl-thioxanthen-(9E)-ylidene]-propyl}-piperazin-1-yl)-ethanol FLUPENTHIXOL, Alpha Flupenthixol | Flupenthixol, Beta
Type:
Small organic molecule
Emp. Form.:
C23H25F3N2OS
Mol. Mass.:
434.518
SMILES:
OCCN1CCN(CC\C=C2/c3ccccc3Sc3ccc(cc23)C(F)(F)F)CC1
: