Target
Metabotropic glutamate receptor 4
Ligand
BDBM50053586
Substrate
Ki
>10000±n/a nM
Comments
PDSP_4813
Citation
 Thomsen, CBoel, ESuzdak, PD Actions of phenylglycine analogs at subtypes of the metabotropic glutamate receptor family. Eur J Pharmacol 267:77-84 (1994)  
Target
Name:
Metabotropic glutamate receptor 4
Synonyms:
GRM4_RAT Grm4 Metabotropic glutamate receptor 4 (mGlu4) mGlu4 metabotropic glutamate 4a
Type:
Enzyme
Mol. Mass.:
101849.79
Organism:
Rattus norvegicus (Rat)
Description:
P31423
Residue:
912
  
Inhibitor
Name:
BDBM50053586
Synonyms:
(S)-3-Carboxy-4-hydroxyphenylglycine 3C4HPG CHEMBL128772
Type:
Small organic molecule
Emp. Form.:
C9H9NO5
Mol. Mass.:
211.1715
SMILES:
N[C@H](C(O)=O)c1ccc(O)c(c1)C(O)=O
: