Target
Melanocortin receptor 5
Ligand
BDBM82411
Substrate
Ki
2.39±n/a nM
Comments
PDSP_2953
Citation
 Schiöth, HBMuceniece, RWikberg, JEChhajlani, V Characterisation of melanocortin receptor subtypes by radioligand binding analysis. Eur J Pharmacol 288:311-7 (1995)  
Target
Name:
Melanocortin receptor 5
Synonyms:
MC-2 MC5R Melanocortin MC5 Melanocortin receptor 5 | Melanocortin receptor 5 (MC5R)
Type:
Enzyme
Mol. Mass.:
36612.92
Organism:
Homo sapiens (Human)
Description:
P33032
Residue:
325
  
Inhibitor
Name:
BDBM82411
Synonyms:
CAS_75921-69-6 | NDP-MSH
Type:
Small organic molecule
Emp. Form.:
C78H111N21O19
Mol. Mass.:
1646.8452
SMILES:
CCCC[C@H](NC(=O)[C@H](CO)NC(=O)[C@H](Cc1ccc(O)cc1)NC(=O)[C@H](CO)NC(C)=O)C(=O)N[C@@H](CCC(O)=O)C(=O)N[C@@H](Cc1cnc[nH]1)C(=O)N[C@H](Cc1ccccc1)C(=O)N[C@@H](CCCN=C(N)N)C(=O)N[C@@H](Cc1c[nH]c2ccccc12)C(=O)NCC(=O)N[C@@H](CCCCN)C(=O)N1CCC[C@H]1C(=O)N[C@@H](C(C)C)C(N)=O
: