Target
Muscarinic acetylcholine receptor M4
Ligand
BDBM82423
Substrate
Ki
6.41±n/a nM
Comments
PDSP_1916
Citation
 Maggio, RBarbier, PBolognesi, MLMinarini, ATedeschi, DMelchiorre, C Binding profile of the selective muscarinic receptor antagonist tripitramine. Eur J Pharmacol 268:459-62 (1994)  
Target
Name:
Muscarinic acetylcholine receptor M4
Synonyms:
ACM4_HUMAN Cholinergic, muscarinic M4 Muscarinic acetylcholine receptor M2 and M4
Type:
Enzyme Catalytic Domain
Mol. Mass.:
53079.31
Organism:
Homo sapiens (Human)
Description:
Cholinergic, muscarinic M4 CHRM4 HUMAN M3::P08173
Residue:
479
  
Inhibitor
Name:
BDBM82423
Synonyms:
CAS_132947 TRIPITRAMINE
Type:
Small organic molecule
Emp. Form.:
C64H77N13O6
Mol. Mass.:
1124.3797
SMILES:
CN(CCCCCCCCN(C)CCCCCCN(CC(=O)N1c2ccccc2C(=O)Nc2cccnc12)CC(=O)N1c2ccccc2C(=O)Nc2cccnc12)CCCCCCNCC(=O)N1c2ccccc2C(=O)Nc2cccnc12
: