Target
Alpha-1B adrenergic receptor
Ligand
BDBM30712
Substrate
Ki
158.48±n/a nM
Comments
PDSP_1428
Citation
 Schwinn, DAJohnston, GIPage, SOMosley, MJWilson, KHWorman, NPCampbell, SFidock, MDFurness, LMParry-Smith, DJ Cloning and pharmacological characterization of human alpha-1 adrenergic receptors: sequence corrections and direct comparison with other species homologues. J Pharmacol Exp Ther 272:134-42 (1995) Target
Name:
Alpha-1B adrenergic receptor
Synonyms:
ADA1B_MESAU adrenergic Alpha1
Type:
Enzyme Catalytic Domain
Mol. Mass.:
56514.13
Organism:
HAMSTER
Description:
adrenergic Alpha1 0 HAMSTER::P18841
Residue:
515
  
Inhibitor
Name:
BDBM30712
Synonyms:
6-tert-butyl-3-(2-imidazolin-2-ylmethyl)-2,4-dimethyl-phenol;hydrochloride 6-tert-butyl-3-(4,5-dihydro-1H-imidazol-2-ylmethyl)-2,4-dimethylphenol;hydrochloride Oxymetazoline cid_66259
Type:
Small organic molecule
Emp. Form.:
C16H24N2O
Mol. Mass.:
260.3746
SMILES:
Cc1cc(c(O)c(C)c1CC1=NCCN1)C(C)(C)C
: