Target
Type-2 angiotensin II receptor
Ligand
BDBM82430
Substrate
Ki
1030±n/a nM
Comments
PDSP_1028
Citation
 Beauchamp, HTChang, RSSiegl, PKGibson, RE In vivo receptor occupancy of the angiotensin II receptor by nonpeptide antagonists: relationship to in vitro affinities and in vivo pharmacologic potency. J Pharmacol Exp Ther 272:612-8 (1995) Target
Name:
Type-2 angiotensin II receptor
Synonyms:
AGTR2_RAT Agtr2 Angiotensin II receptor Type-2 angiotensin II receptor
Type:
Enzyme Catalytic Domain
Mol. Mass.:
41346.62
Organism:
RAT
Description:
Angiotensin II AT2 0 0::P35351
Residue:
363
  
Inhibitor
Name:
BDBM82430
Synonyms:
2-Propyl-3-[[2'-(1H-tetrazol-5-yl)biphenyl-4-yl]methyl]-6-(phenylamino)quinazolin-4(3H)-one L-161948
Type:
Small organic molecule
Emp. Form.:
C31H27N7O
Mol. Mass.:
513.5924
SMILES:
CCCc1nc2ccc(Nc3ccccc3)cc2c(=O)n1Cc1ccc(cc1)-c1ccccc1-c1nnn[nH]1
: