Target
Pituitary adenylate cyclase-activating polypeptide
Ligand
BDBM81529
Substrate
Ki
1000±n/a nM
Comments
PDSP_2367
Citation
 Hou, XVandermeers, AGourlet, PVandermeers-Piret, MCRobberecht, P Structural requirements for the occupancy of rat brain PACAP receptors and adenylate cyclase activation. Neuropharmacology 33:1189-95 (1994)  
Target
Name:
Pituitary adenylate cyclase-activating polypeptide
Synonyms:
Adcyap1 PACAP-27 PACA_RAT | Pituitary adenylate cyclase-activating polypeptide
Type:
Enzyme Catalytic Domain
Mol. Mass.:
19565.66
Organism:
RAT
Description:
PACAP 0 RAT::P13589
Residue:
175
  
Inhibitor
Name:
BDBM81529
Synonyms:
PACAP(5-27) | PACAP(6-27)
Type:
Small organic molecule
Emp. Form.:
C121H193N33O31S
Mol. Mass.:
2638.095
SMILES:
[#6]-[#16]-[#6]-[#6]-[#6@H](-[#7]-[#6](=O)-[#6@H](-[#6]-[#6]-[#6](-[#7])=O)-[#7]-[#6](=O)-[#6@H](-[#6]-[#6]-[#6]-[#6]-[#7])-[#7]-[#6](=O)-[#6@H](-[#6]-[#6]-[#6]\[#7]=[#6](/[#7])-[#7])-[#7]-[#6](=O)-[#6@H](-[#6]-c1ccc(-[#8])cc1)-[#7]-[#6](=O)-[#6@H](-[#6]-[#6]-[#6]\[#7]=[#6](/[#7])-[#7])-[#7]-[#6](=O)-[#6@H](-[#6]-[#8])-[#7]-[#6](=O)-[#6@H](-[#6]-c1ccc(-[#8])cc1)-[#7]-[#6](=O)-[#6@H](-[#6]-[#8])-[#7]-[#6](=O)-[#6@H](-[#6]-[#6](-[#8])=O)-[#7]-[#6](=O)-[#6@@H](-[#7]-[#6](=O)-[#6@@H](-[#7])-[#6]-c1ccccc1)-[#6@@H](-[#6])-[#8])-[#6](=O)-[#7]-[#6@@H](-[#6])-[#6](=O)-[#7]-[#6@@H](-[#6](-[#6])-[#6])-[#6](=O)-[#7]-[#6@@H](-[#6]-[#6]-[#6]-[#6]-[#7])-[#6](=O)-[#7]-[#6@@H](-[#6]-[#6]-[#6]-[#6]-[#7])-[#6](=O)-[#7]-[#6@@H](-[#6]-c1ccc(-[#8])cc1)-[#6](=O)-[#7]-[#6@@H](-[#6]-[#6](-[#6])-[#6])-[#6](=O)-[#7]-[#6@@H](-[#6])-[#6](=O)-[#7]-[#6@@H](-[#6])-[#6](=O)-[#7]-[#6@@H](-[#6](-[#6])-[#6])-[#6](=O)-[#7]-[#6@@H](-[#6]-[#6](-[#6])-[#6])-[#6](-[#7])=O
: