Target
Somatostatin receptor type 3
Ligand
BDBM82469
Substrate
Ki
2.08±n/a nM
Comments
PDSP_372
Citation
 Hoyer, DLübbert, HBruns, C Molecular pharmacology of somatostatin receptors. Naunyn Schmiedebergs Arch Pharmacol 350:441-53 (1994)  
Target
Name:
Somatostatin receptor type 3
Synonyms:
SOMATOSTATIN SST3 SSR-28 Smstr3 Somatostatin receptor 3 Sstr3
Type:
Enzyme Catalytic Domain
Mol. Mass.:
47225.49
Organism:
MOUSE
Description:
SOMATOSTATIN SST3 SSTR3 MOUSE::P30935
Residue:
428
  
Inhibitor
Name:
BDBM82469
Synonyms:
BIM 23003 EC5-21 | L-Cys(1)-L-Lys-L-Asn-4-Chloro-L-Phe-L-Phe-D-Trp-L-Lys-L-Thr-L-Phe-L-Thr-L-Ser-L-Cys(1)-OH
Type:
Small organic molecule
Emp. Form.:
C71H95ClN16O17S2
Mol. Mass.:
1544.194
SMILES:
C[C@@H](O)[C@@H]1NC(=O)[C@H](CCCCN)NC(=O)[C@@H](Cc2c[nH]c3ccccc23)NC(=O)[C@H](Cc2ccccc2)NC(=O)[C@H](Cc2ccc(Cl)cc2)NC(=O)[C@H](CC(N)=O)NC(=O)[C@H](CCCCN)NC(=O)[C@@H](N)CSSC[C@H](NC(=O)[C@H](CO)NC(=O)[C@@H](NC(=O)[C@H](Cc2ccccc2)NC1=O)[C@@H](C)O)C(O)=O
: