Target
Type-1 angiotensin II receptor A
Ligand
BDBM82259
Substrate
Ki
0.7±n/a nM
Comments
PDSP_1019
Citation
 Keiser, JARyan, MJPanek, RLHodges, JCSircar, I Pharmacologic characterization of CI-996, a new angiotensin receptor antagonist. J Pharmacol Exp Ther 272:963-9 (1995) Target
Name:
Type-1 angiotensin II receptor A
Synonyms:
AGTRA_RAT Agtr1 Angiotensin II AT1 Angiotensin II receptor (AT-1) type-1 Type-1A angiotensin II receptor
Type:
Enzyme Catalytic Domain
Mol. Mass.:
40910.53
Organism:
RAT
Description:
ANGIOTENSIN AT1 AGTR1 RAT::P25095
Residue:
359
  
Inhibitor
Name:
BDBM82259
Synonyms:
CAS_123856 NSC_123856
Type:
Small organic molecule
Emp. Form.:
C23H21N7
Mol. Mass.:
395.4597
SMILES:
CCc1nc2c(C)cc(C)nc2n1-c1ccc(cc1)-c1ccccc1-c1nnn[nH]1
: