Target
5-hydroxytryptamine receptor 2A
Ligand
BDBM50040241
Substrate
Ki
6.3±n/a nM
Comments
PDSP_836
Citation
 Roth, BLCraigo, SCChoudhary, MSUluer, AMonsma, FJShen, YMeltzer, HYSibley, DR Binding of typical and atypical antipsychotic agents to 5-hydroxytryptamine-6 and 5-hydroxytryptamine-7 receptors. J Pharmacol Exp Ther 268:1403-10 (1994) Target
Name:
5-hydroxytryptamine receptor 2A
Synonyms:
5-HT-2A 5-HT2A 5-hydroxytryptamine receptor 2A (5HT2A) Htr2 Serotonin Receptor 2A
Type:
G Protein-Coupled Receptor (GPCR)
Mol. Mass.:
52852.05
Organism:
Rattus norvegicus (rat)
Description:
Rat cortex membranes 5-HT2A receptors.
Residue:
471
  
Inhibitor
Name:
BDBM50040241
Synonyms:
3-Fluoro-6-(4-methyl-piperazin-1-yl)-11H-dibenzo[b,e]azepine CHEMBL63756 | Fluperlapine
Type:
Small organic molecule
Emp. Form.:
C19H20FN3
Mol. Mass.:
309.3806
SMILES:
CN1CCN(CC1)C1=Nc2cc(F)ccc2Cc2ccccc12
: