Target
5-hydroxytryptamine receptor 7
Ligand
BDBM78576
Substrate
Ki
12±n/a nM
Comments
PDSP_1850
Citation
 Roth, BLCraigo, SCChoudhary, MSUluer, AMonsma, FJShen, YMeltzer, HYSibley, DR Binding of typical and atypical antipsychotic agents to 5-hydroxytryptamine-6 and 5-hydroxytryptamine-7 receptors. J Pharmacol Exp Ther 268:1403-10 (1994) Target
Name:
5-hydroxytryptamine receptor 7
Synonyms:
5-HT-7 5-HT7 5-HT7S 5-hydroxytryptamine receptor 7 5HT7R_RAT GPRFO Serotonin (5-HT) receptor | Serotonin Receptor 7
Type:
G Protein-Coupled Receptor (GPCR)
Mol. Mass.:
49852.62
Organism:
Rattus norvegicus (rat)
Description:
Rat cloned 5-HT7R.
Residue:
448
  
Inhibitor
Name:
BDBM78576
Synonyms:
CIS-THIOTHIXENE SMR000058396 cid_941651 | med.21724, Compound Thiothixene
Type:
Small organic molecule
Emp. Form.:
C23H29N3O2S2
Mol. Mass.:
443.625
SMILES:
CN(C)S(=O)(=O)c1ccc2Sc3ccccc3\C(=C\CCN3CCN(C)CC3)c2c1
: