Target
Beta-1 adrenergic receptor
Ligand
BDBM82498
Substrate
Ki
7.41±n/a nM
Comments
PDSP_1873
Citation
 Fraundorfer, PFFertel, RHMiller, DDFeller, DR Biochemical and pharmacological characterization of high-affinity trimetoquinol analogs on guinea pig and human beta adrenergic receptor subtypes: evidence for partial agonism. J Pharmacol Exp Ther 270:665-74 (1994) Target
Name:
Beta-1 adrenergic receptor
Synonyms:
ADRB1 ADRB1_HUMAN Beta-1 adrenoceptor | adrenergic Beta1
Type:
G Protein-Coupled Receptor (GPCR)
Mol. Mass.:
51338.40
Organism:
Homo sapiens (Human)
Description:
P08588
Residue:
477
  
Inhibitor
Name:
BDBM82498
Synonyms:
TMQ, 5,8-Difluoro
Type:
Small organic molecule
Emp. Form.:
C19H21F2NO5
Mol. Mass.:
381.3705
SMILES:
COc1cc(CC2NCCc3c(F)c(O)c(O)c(F)c23)cc(OC)c1OC
: