Target
Beta-1 adrenergic receptor
Ligand
BDBM82498
Substrate
Ki
34.67±n/a nM
Comments
PDSP_1873
Citation
 Fraundorfer, PFFertel, RHMiller, DDFeller, DR Biochemical and pharmacological characterization of high-affinity trimetoquinol analogs on guinea pig and human beta adrenergic receptor subtypes: evidence for partial agonism. J Pharmacol Exp Ther 270:665-74 (1994) Target
Name:
Beta-1 adrenergic receptor
Synonyms:
ADRB1 adrenergic Beta1
Type:
Enzyme Catalytic Domain
Mol. Mass.:
50540.48
Organism:
GUINEA PIG
Description:
adrenergic Beta1 ADRB1 GUINEA PIG::B0FL73
Residue:
467
  
Inhibitor
Name:
BDBM82498
Synonyms:
TMQ, 5,8-Difluoro
Type:
Small organic molecule
Emp. Form.:
C19H21F2NO5
Mol. Mass.:
381.3705
SMILES:
COc1cc(CC2NCCc3c(F)c(O)c(O)c(F)c23)cc(OC)c1OC
: