Target
Beta-2 adrenergic receptor
Ligand
BDBM82491
Substrate
Ki
2.75±n/a nM
Comments
PDSP_1872
Citation
 Fraundorfer, PFFertel, RHMiller, DDFeller, DR Biochemical and pharmacological characterization of high-affinity trimetoquinol analogs on guinea pig and human beta adrenergic receptor subtypes: evidence for partial agonism. J Pharmacol Exp Ther 270:665-74 (1994) Target
Name:
Beta-2 adrenergic receptor
Synonyms:
ADRB2_CAVPO adrenergic Beta2
Type:
Enzyme Catalytic Domain
Mol. Mass.:
46993.24
Organism:
GUINEA PIG
Description:
adrenergic Beta2 ADRB2 GUINEA PIG::Q8K4Z4
Residue:
418
  
Inhibitor
Name:
BDBM82491
Synonyms:
TMQ, 3'-Nitro
Type:
Small organic molecule
Emp. Form.:
C18H20N2O6
Mol. Mass.:
360.3612
SMILES:
COc1cc(CC2NCCc3cc(O)c(O)cc23)cc(c1OC)[N+]([O-])=O
: