Target
Beta-2 adrenergic receptor
Ligand
BDBM82498
Substrate
Ki
6.16±n/a nM
Comments
PDSP_1873
Citation
 Fraundorfer, PFFertel, RHMiller, DDFeller, DR Biochemical and pharmacological characterization of high-affinity trimetoquinol analogs on guinea pig and human beta adrenergic receptor subtypes: evidence for partial agonism. J Pharmacol Exp Ther 270:665-74 (1994) Target
Name:
Beta-2 adrenergic receptor
Synonyms:
ADRB2 ADRB2_HUMAN Beta-2 adrenoceptor | Beta-2 adrenoreceptor
Type:
Mol. Mass.:
46461.69
Organism:
Homo sapiens (Human)
Description:
P07550
Residue:
413
  
Inhibitor
Name:
BDBM82498
Synonyms:
TMQ, 5,8-Difluoro
Type:
Small organic molecule
Emp. Form.:
C19H21F2NO5
Mol. Mass.:
381.3705
SMILES:
COc1cc(CC2NCCc3c(F)c(O)c(O)c(F)c23)cc(OC)c1OC
: