Target
Histamine H1 receptor
Ligand
BDBM35938
Substrate
Ki
0.5±n/a nM
Comments
PDSP_512
Citation
 Moguilevsky, NVarsalona, FNoyer, MGillard, MGuillaume, JPGarcia, LSzpirer, CSzpirer, JBollen, A Stable expression of human H1-histamine-receptor cDNA in Chinese hamster ovary cells. Pharmacological characterisation of the protein, tissue distribution of messenger RNA and chromosomal localisation of the gene. Eur J Biochem 224:489-95 (1994)  
Target
Name:
Histamine H1 receptor
Synonyms:
HISTAMINE H1 HRH1_CAVPO
Type:
G Protein-Coupled Receptor (GPCR)
Mol. Mass.:
55641.53
Organism:
Cavia porcellus (domestic guinea pig)
Description:
Guinea pig cerebellum was used in binding assay.
Residue:
488
  
Inhibitor
Name:
BDBM35938
Synonyms:
1-(p-chlorophenyl)-1-(2-pyridyl)-3-N,N-dimethylpropylamine 3-(p-chlorophenyl)-3-(2-pyridyl)-N,N-dimethylpropylamine CHEMBL505 CHLORPHENIRAMINE MALEATE Polaramine [3H]Chlorphenamine chlorophenylpyridamine clorfeniramina gamma-(4-chlorophenyl)-N,N-dimethyl-2-pyridinepropanamine | gamma-(4-chlorophenyl)-gamma-(2-pyridyl)propyldimethylamine
Type:
radiolabeled ligand
Emp. Form.:
C16H19ClN2
Mol. Mass.:
274.788
SMILES:
CN(C)CCC(c1ccc(Cl)cc1)c1ccccn1
: