Target
5-hydroxytryptamine receptor 1D
Ligand
BDBM81498
Substrate
Ki
63.09±n/a nM
Comments
PDSP_1643
Citation
 Boess, FGMartin, IL Molecular biology of 5-HT receptors. Neuropharmacology 33:275-317 (1994)  
Target
Name:
5-hydroxytryptamine receptor 1D
Synonyms:
5-HT1D 5HT1D_CANLF RDC4
Type:
Enzyme Catalytic Domain
Mol. Mass.:
41894.67
Organism:
Dog
Description:
5-HT1D HTR1D Dog::P11614
Residue:
377
  
Inhibitor
Name:
BDBM81498
Synonyms:
5-Methoxy-3-(1,2,3,6-tetrahydro-pyridin-4-yl)-1H-indole(RU-24969) CHEMBL18785 RU 24969
Type:
Small organic molecule
Emp. Form.:
C14H16N2O
Mol. Mass.:
228.2896
SMILES:
COc1ccc2[nH]cc(C3=CCNCC3)c2c1
: