Target
5-hydroxytryptamine receptor 2C
Ligand
BDBM35256
Substrate
Ki
1.99±n/a nM
Comments
PDSP_1235
Citation
 Boess, FGMartin, IL Molecular biology of 5-HT receptors. Neuropharmacology 33:275-317 (1994)  
Target
Name:
5-hydroxytryptamine receptor 2C
Synonyms:
5-HT2C 5-hydroxytryptamine receptor 2C (5HT2c) 5ht1c Htr2c Serotonin receptor 2a and 2c (5HT2A and 5HT2C)
Type:
Enzyme
Mol. Mass.:
51935.10
Organism:
Rattus norvegicus (Rat)
Description:
P08909
Residue:
460
  
Inhibitor
Name:
BDBM35256
Synonyms:
(S)-mianserin MIANSERIN MIANSERIN (-) | Tolvon
Type:
Small organic molecule
Emp. Form.:
C18H20N2
Mol. Mass.:
264.3648
SMILES:
[H][C@]12CN(C)CCN1c1ccccc1Cc1ccccc21
: