Target
5-hydroxytryptamine receptor 3A
Ligand
BDBM50000690
Substrate
Ki
8.7±n/a nM
Comments
PDSP_1927
Citation
 Boess, FGMartin, IL Molecular biology of 5-HT receptors. Neuropharmacology 33:275-317 (1994)  
Target
Name:
5-hydroxytryptamine receptor 3A
Synonyms:
5-HT-3 5-HT3A 5-HT3R 5-hydroxytryptamine receptor 3A 5ht3 Htr3a Serotonin 3a (5-HT3a) receptor Serotonin-gated ion channel receptor
Type:
Mol. Mass.:
56056.00
Organism:
Mus musculus (house mouse)
Description:
5HT3A
Residue:
487
  
Inhibitor
Name:
BDBM50000690
Synonyms:
10,25-dimethoxy-15,15,30-trimethyl-(1S,16R)-7,23-dioxa-15,30-diazoniaheptacyclo[22.6.2.23,6.112,16.118,22.08,36.027,31]hexatriaconta-3,5,8,10,12(36),18,20,22(35),24(32),25,27(31),33-dodecaene-9,21-diol,dichloride(tubocurarine) Tubocurarine Tubocurarine,d
Type:
Small organic molecule
Emp. Form.:
C37H42N2O6
Mol. Mass.:
610.7381
SMILES:
COc1cc2CC[N+](C)(C)[C@@H]3Cc4ccc(O)c(Oc5cc6[C@H](Cc7ccc(Oc(c1O)c23)cc7)[NH+](C)CCc6cc5OC)c4
: