Target
Muscarinic acetylcholine receptor M3
Ligand
BDBM82437
Substrate
Ki
130±n/a nM
Comments
PDSP_1088
Citation
 Stanton, TBolden-Watson, CCusack, BRichelson, E Antagonism of the five cloned human muscarinic cholinergic receptors expressed in CHO-K1 cells by antidepressants and antihistaminics. Biochem Pharmacol 45:2352-4 (1993)  
Target
Name:
Muscarinic acetylcholine receptor M3
Synonyms:
ACM3_HUMAN Cholinergic, muscarinic M3 Muscarinic receptor M3 | RecName: Full=Muscarinic acetylcholine receptor M3
Type:
Enzyme
Mol. Mass.:
66151.03
Organism:
Homo sapiens (Human)
Description:
P20309
Residue:
590
  
Inhibitor
Name:
BDBM82437
Synonyms:
CAS_23047-25-8 NSC_3947 | US8629135, SW-06
Type:
Small organic molecule
Emp. Form.:
C26H27ClN2O
Mol. Mass.:
418.958
SMILES:
CN(CCCN1c2ccccc2CCc2ccccc12)CC(=O)c1ccc(Cl)cc1
: