Target
D(2) dopamine receptor
Ligand
BDBM50047138
Substrate
Ki
0.9±n/a nM
Comments
PDSP_1698
Citation
 Lahti, RAEvans, DLStratman, NCFigur, LM Dopamine D4 versus D2 receptor selectivity of dopamine receptor antagonists: possible therapeutic implications. Eur J Pharmacol 236:483-6 (1993)  
Target
Name:
D(2) dopamine receptor
Synonyms:
D(2) dopamine receptor DOPAMINE D2 Long DRD2 Dopamine D2 receptor Dopamine D2 receptor (D2R) Dopamine2-like | d2
Type:
Cell-surface receptors
Mol. Mass.:
50647.10
Organism:
Homo sapiens (Human)
Description:
P14416
Residue:
443
  
Inhibitor
Name:
BDBM50047138
Synonyms:
CHEMBL25074 SDZ-208-912 | SDZ-HDC-912
Type:
Small organic molecule
Emp. Form.:
C20H26ClN3O
Mol. Mass.:
359.893
SMILES:
CN1C[C@H](CC2[C@H]1Cc1c(Cl)[nH]c3cccc2c13)NC(=O)C(C)(C)C
: