Target
5-hydroxytryptamine receptor 7
Ligand
BDBM7966
Substrate
Ki
>10000±n/a nM
Comments
PDSP_934
Citation
 Bard, JAZgombick, JAdham, NVaysse, PBranchek, TAWeinshank, RL Cloning of a novel human serotonin receptor (5-HT7) positively linked to adenylate cyclase. J Biol Chem 268:23422-6 (1993) Target
Name:
5-hydroxytryptamine receptor 7
Synonyms:
5-HT-7 5-HT7 5-HT7S 5HT7 HTR7 | Serotonin receptor 7
Type:
G Protein-Coupled Receptor (GPCR)
Mol. Mass.:
53573.08
Organism:
Homo sapiens (Human)
Description:
P34969
Residue:
479
  
Inhibitor
Name:
BDBM7966
Synonyms:
2-(1H-imidazol-4-yl)ethan-1-amine CHEMBL90 Ergotidine Histamine Peremin | [3H]histamine
Type:
Small organic molecule
Emp. Form.:
C5H9N3
Mol. Mass.:
111.1451
SMILES:
NCCc1cnc[nH]1
: