Target
Muscarinic acetylcholine receptor M2
Ligand
BDBM50064176
Substrate
Ki
14.45±n/a nM
Comments
PDSP_6
Citation
 Melchiorre, CBolognesi, MLChiarini, AMinarini, ASpampinato, S Synthesis and biological activity of some methoctramine-related tetraamines bearing a 11-acetyl-5,11-dihydro-6H-pyrido[2,3-b][1,4]-benzodiazepin-6-one moiety as antimuscarinics: a second generation of highly selective M2 muscarinic receptor antagonists. J Med Chem 36:3734-7 (1993)  
Target
Name:
Muscarinic acetylcholine receptor M2
Synonyms:
ACM2_RAT Chrm-2 | Chrm2
Type:
Enzyme Catalytic Domain
Mol. Mass.:
51555.53
Organism:
RAT
Description:
P10980
Residue:
466
  
Inhibitor
Name:
BDBM50064176
Synonyms:
CHEMBL27673 METHOCTRAMINE N1,N8-bis(6-(2-methoxybenzylamino)hexyl)octane-1,8-diamine
Type:
Small organic molecule
Emp. Form.:
C36H62N4O2
Mol. Mass.:
582.9031
SMILES:
COc1ccccc1CNCCCCCCNCCCCCCCCNCCCCCCNCc1ccccc1OC
: